desenvolvimento cultural
type: Concept
preferred label: تنمية ثقافية @ar
preferred label: cultural development @en-gb
preferred label: Kulturhistoria @se
preferred label: Kulturgeschichte @de
preferred label: Histoire de l'art @fr
preferred label: Artes tradicionales @es
preferred label: kulturhistorie @dk
preferred label: 文化发展 @zh-hans
definition: Hur kultur utvecklats under olika tidsperioder. @se
definition: Histoire du développement de l'art et de la culture comme l'évolution des peintures rupestres, les variations linguistiques dans le temps, l'évolution des valeurs socioculturelles @fr
definition: Historia del desarrollo del arte y de la cultura, como la evolución de las pinturas rupestres, las variaciones lingüísticas a lo largo del tiempo, la evolución de los valores @es
definition: Die Geschichte der Entwicklung von Kunst und Kultur, wie beispielsweise die Entstehung der Höhlenmalerei, die Änderungen in der Sprache über die Zeit hinweg, die Entwicklung von Werten. @de
definition: The history of the development of art and culture such as the rise of cave paintings, linguistic variations over time, the evolution of values @en-gb
definition: História do desenvolvimento de artes e culturas, tais como pinturas rupestres, arte pré-colombiana ou confeção de papel chinês.
definition: História do desenvolvimento de artes e culturas, tais como pinturas rupestres, arte pré-colombiana, confecção de papel chinês.
definition: Historien om, hvordan kunst og kultur har udviklet sig over forskellige tidsperioder. @dk
definition: 艺术和文化发展史，如岩画的兴起、语言随时间的变化、价值观的演变 @zh-hans
in scheme: mediatopic
created: 2009-10-22T02:00:00+00:00
modified: 2021-02-18T12:00:00+00:00
broader: http://cv.iptc.org/newscodes/mediatopic/20000038