festive event (culture)
type: Concept
preferred label: Kulturell fest eller händelse @se
preferred label: Festividades @es
preferred label: Fest (Kultur) @de
preferred label: حدث احتفالي @ar
preferred label: Festivals et commémorations @fr
preferred label: festividades (cultura) @pt-pt
preferred label: festlig begivenhed (kultur) @dk
preferred label: 节日活动（文化） @zh-hans
preferred label: festivaler @no-nb
preferred label: festivalar @no-nn
definition: Ein Ereignis, das von einer Gruppe gefeiert wird und das sich auf eine charakteristische Eigenschaft der Gruppe oder ihrer Religion oder Gebräuche konzentriert @de
definition: An event ordinarily celebrated by a community and centring on some characteristic aspect of that community and its religion or traditions
definition: Evento comúnmente celebrado por una comunidad y centrado en algún aspecto característico de esa comunidad y su religión o sus tradiciones @es
definition: Événement habituellement célébré par une communauté et centré sur un aspect caractéristique de cette communauté, de sa religion ou de ses traditions @fr
definition: En händelse som firas av en grupp personer med samma intresse och som fokuserar på en karakteristisk aspekt av gruppen och dess traditioner. @se
definition: Um evento geralmente celebrado por uma comunidade e centrado em algum aspeto dessa comunidade ou na sua religião e tradições. @pt-pt
definition: Um evento geralmente celebrado por uma comunidade e centrado em algum aspeto dessa comunidade ou em sua religião e tradições. @pt-br
definition: En begivenhed fejret af en gruppe mennesker med samme interesse, og som fokuserer på et karakteristisk aspekt af gruppen og dens traditioner. @dk
definition: 通常由一个社群举行的庆祝活动，以该社群及其宗教或传统的某些特征为中心 @zh-hans
definition: An event ordinarily celebrated by a community and centering on some characteristic aspect of that community and its religion or traditions
in scheme: mediatopic
created: 2009-10-22T02:00:00+00:00
modified: 2021-02-18T12:00:00+00:00
broader: http://cv.iptc.org/newscodes/mediatopic/20000038