Festividades
type: Concept
definition: Evento comúnmente celebrado por una comunidad y centrado en algún aspecto característico de esa comunidad y su religión o sus tradiciones
in scheme: mediatopic
created: 2009-10-22T02:00:00+00:00
modified: 2021-02-18T12:00:00+00:00
broader: http://cv.iptc.org/newscodes/mediatopic/20000038