festividades (cultura)
type: Concept
definition: Um evento geralmente celebrado por uma comunidade e centrado em algum aspeto dessa comunidade ou na sua religião e tradições.
in scheme: mediatopic
created: 2009-10-22T02:00:00+00:00
modified: 2021-02-18T12:00:00+00:00
broader: http://cv.iptc.org/newscodes/mediatopic/20000038