Bibliothek und Museum
type: Concept
definition: Einrichtungen, die Sammlungen von Büchern, Musik, Kunst oder Objekten aus der Vergangenheit beherbergen und wahlweise der Öffentlichkeit zur Besichtigung und Nutzung öffnen
in scheme: mediatopic
created: 2009-10-22T02:00:00+00:00
modified: 2021-05-05T12:00:00+00:00
broader: http://cv.iptc.org/newscodes/mediatopic/20000038