Bibliotecas y museos
type: Concept
preferred label: Bibliothèque et musée @fr
preferred label: مكاتب ومتاحف @ar
preferred label: library and museum @en-gb
preferred label: Bibliotek och museum @se
preferred label: Bibliothek und Museum @de
preferred label: bibliotecas e museus @pt-pt
preferred label: bibliotek og museum @dk
preferred label: 图书馆和博物馆 @zh-hans
definition: Instituciones que albergan colecciones de libros, música, arte u objetos del pasado y del presente, opcionalmente para uso público y exposiciones
definition: Institutioner som samlar böcker, musikinspelningar, filmer, konstverk och gamla saker från olika tidsepoker och låter intresserade titta på dessa och i vissa fall låna hem dem. @se
definition: Einrichtungen, die Sammlungen von Büchern, Musik, Kunst oder Objekten aus der Vergangenheit beherbergen und wahlweise der Öffentlichkeit zur Besichtigung und Nutzung öffnen @de
definition: Institutions that house collections of books, music, art, or objects from the past and present optionally for public use and display @en-gb
definition: Institution qui abrite des collections de livres, de musique, d'œuvres d'art ou d'objets du passé et du présent pouvant être exposées ou mises à la disposition du public @fr
definition: Edifícios utilizados para albergar coleções de livros, música, arte ou objetos do passado e do presente para uso público e exibição. @pt-pt
definition: Institutioner, der samler bøger, musikoptagelser, film, kunstværker og gamle ting fra forskellige epoker og lader interesserede se på dem og i nogle tilfælde låne dem hjem. @dk
definition: 收藏书籍、音乐、艺术品等的机构，既可服务于公共用途，也可以是对内用途 @zh-hans
in scheme: mediatopic
created: 2009-10-22T02:00:00+00:00
modified: 2021-05-05T12:00:00+00:00
broader: http://cv.iptc.org/newscodes/mediatopic/20000038