Bibliotecas y museos
type: Concept
definition: Instituciones que albergan colecciones de libros, música, arte u objetos del pasado y del presente, opcionalmente para uso público y exposiciones
in scheme: mediatopic
created: 2009-10-22T02:00:00+00:00
modified: 2021-05-05T12:00:00+00:00
broader: http://cv.iptc.org/newscodes/mediatopic/20000038