órgãos noticiosos
type: Concept
preferred label: news media @en-gb
preferred label: Nachrichtensender @de
preferred label: اعلام اخباري @ar
preferred label: Medios de información @es
preferred label: Média d'information @fr
preferred label: Nyhetsmedier @se
preferred label: mídia noticiosa
preferred label: nyhedsmedie @dk
preferred label: 新闻媒体 @zh-hans
preferred label: nyhetsmedier @no-nb
preferred label: nyheitsmedium @no-nn
definition: Présentation d'informations au public à travers différentes plateformes, telles que la télévision, la radio, les journaux, les magazines et l'internet @fr
definition: Presentación de noticias al público a través de diferentes plataformas, televisión, radio, periódicos, revistas, páginas web y blogs @es
definition: Massmedier som har som första syfte att samla in och presentera sådant som är nytt för sin respektive publik. @se
definition: The presentation of news to the public through different platforms, such as TV, radio, newspapers, magazines, web pages and blogs @en-gb
definition: Die Präsentation von Nachrichten gegenüber der Öffentlichkeit in unterschiedlichen Formen wie Fernsehen, Radion, Zeitungen, Magazinen, Webseiten oder Blogs @de
definition: Órgãos de comunicação que se dedicam à difusão pública de notícias, incluindo as publicações impressas (jornais e revistas), a rádio e a televisão e, mais recentemente, os serviços de notícias eletrónicos.
definition: Televisão, rádio, serviços de notícias que recolhem fatos sobre incidentes, desenvolvendo e fazendo sua apresentação ao público como uma história completa.
definition: Præsentation af nyheder til offentligheden gennem forskellige platforme, såsom tv, radio, aviser, magasiner, websider og blogs. @dk
definition: 通过电视、广播、报纸、杂志、网页和博客等不同平台向公众传播新闻的机构 @zh-hans
in scheme: mediatopic
created: 2009-10-22T02:00:00+00:00
modified: 2021-02-18T12:00:00+00:00
broader: http://cv.iptc.org/newscodes/mediatopic/20000045