Diarios y revistas
type: Concept
definition: Publicación diaria o semanal que presenta las noticias, a nivel local, regional o mundial, reportajes, columnas de opinión, cómics y otros contenidos
in scheme: mediatopic
created: 2009-10-22T02:00:00+00:00
modified: 2021-02-18T12:00:00+00:00
broader: http://cv.iptc.org/newscodes/mediatopic/20000045