Journaux
type: Concept
definition: Publication périodique qui présente des informations locales, régionales ou mondiales, ainsi que des sujets magazines, des reportages, des articles d'opinion, des bandes dessinées et d'autres contenus
in scheme: mediatopic
created: 2009-10-22T02:00:00+00:00
modified: 2021-02-18T12:00:00+00:00
broader: http://cv.iptc.org/newscodes/mediatopic/20000045