jornais
type: Concept
preferred label: صحيفة @ar
preferred label: Journaux @fr
preferred label: Zeitung @de
preferred label: Tidningar @se
preferred label: newspaper @en-gb
preferred label: Diarios y revistas @es
preferred label: avis @dk
preferred label: 报纸 @zh-hans
definition: Regelbundet producerade publikationer som innehåller nyheter och andra saker som är av intresse för läsarna. Var tidigare uteslutande distribuerat i pappersform, men nya tekniska lösningar används numera. @se
definition: Daily or weekly publication that presents the news, locally, regionally or globally, as well as features, opinion columns, comics and other content @en-gb
definition: Publication périodique qui présente des informations locales, régionales ou mondiales, ainsi que des sujets magazines, des reportages, des articles d'opinion, des bandes dessinées et d'autres contenus @fr
definition: Eine täglich oder wöchentlich erscheinende Publikation, die Lokal-, Regional- oder Weltnachrichten präsentiert sowie Features, Meinungsspalten, Comics und weitere Inhalte @de
definition: Publicación diaria o semanal que presenta las noticias, a nivel local, regional o mundial, reportajes, columnas de opinión, cómics y otros contenidos @es
definition: Publicações diárias ou semanais que apresentam em geral notícias e informações atualizadas, locais, nacionais e internacionais, assim como artigos de opinião, artigos de fundo, banda desenhada e outros conteúdos.
definition: Publicações diárias ou semanais que apresentam em geral notícias e informações atualizadas, locais, nacionais e internacionais, assim como artigos de opinião, artigos de fundo, quadrinhos e outros conteúdos.
definition: Regelmæssigt producerede publikationer, der indeholder nyheder og andet indhold af interesse for læserne. @dk
definition: 每日或每周发行的出版物，提供本地、区域或全球新闻以及专题、评论专栏、漫画和其他内容 @zh-hans
in scheme: mediatopic
created: 2009-10-22T02:00:00+00:00
modified: 2021-02-18T12:00:00+00:00
broader: http://cv.iptc.org/newscodes/mediatopic/20000045