Périodiques
type: Concept
preferred label: دورية @ar
preferred label: Periodiska tidskrifter @se
preferred label: Periódicos @es
preferred label: periodical @en-gb
preferred label: Zeitschrift @de
preferred label: periódicos @pt-pt
preferred label: tidssskrift og magasin @dk
preferred label: 期刊 @zh-hans
preferred label: tidsskrift @no-nb
definition: Publication qui est généralement publiée chaque semaine, toutes les deux semaines, tous les mois ou tous les ans, comme les magazines, les revues et les bulletins d'information
definition: Publication that is usually published weekly, bi-weekly, monthly or annually, such as magazines, journals or newsletters @en-gb
definition: Publicación que generalmente se publica semanal, quincenal, mensual o anualmente, como revistas o boletines @es
definition: Sammanställningar av material som är mer specialicerat och som publiceras regelbundet, men mer sällan än tidningar. @se
definition: Eine Publikation, die üblicherweise wöchentlich, vierzehntägig, monatlich, quartalsweise oder jährlich erscheint, wie zum Beispiel Magazine, Zeitschriften oder Rundbriefe @de
definition: Material escrito que se publica semanal, quinzenal, mensal ou anualmente. @pt-pt
definition: Publikation, der normalt offentliggøres ugentligt, månedligt eller årligt, såsom magasiner, tidsskrifter eller nyhedsbreve. @dk
definition: 通常每周、每两周、每月或每年出版的出版物，如杂志、期刊或时事通讯 @zh-hans
in scheme: mediatopic
created: 2009-10-22T02:00:00+00:00
modified: 2021-02-18T12:00:00+00:00
broader: http://cv.iptc.org/newscodes/mediatopic/20000045