Conflit armé
type: Concept
preferred label: Bewaffneter Konflikt @de
preferred label: armed conflict @en-gb
preferred label: Militära konflikter @se
preferred label: Conflictos armados @es
preferred label: نزاع مسلح @ar
preferred label: conflito armado @pt-pt
preferred label: væbnet konflikt @dk
preferred label: 武装冲突 @zh-hans
preferred label: væpnet konflikt @no-nb
preferred label: væpna konflikt @no-nn
definition: Conflictos entre grupos opuestos que involucran el uso de armas, pero no necesariamente guerras declaradas @es
definition: Dispyter mellan väpnade trupper, inte nödvändigtvis formella krig. @se
definition: Disputes between opposing groups involving the use of weapons, but not necessarily formally declared wars @en-gb
definition: Conflits entre groupes opposés impliquant l'utilisation d'armes, pas nécessairement des guerres déclarées
definition: Auseinandersetzungen zwischen gegensätzlichen Gruppen, unter Einsatz von Waffen @de
definition: Disputas entre grupos opostos, envolvendo o uso de armas, mas não sendo guerra declarada. @pt-pt
definition: Tvister mellem væbnede tropper, ikke nødvendigvis formelle krige. @dk
definition: 敌对团体之间的争端涉及使用武器，但不一定是正式宣战 @zh-hans
in scheme: mediatopic
created: 2009-10-22T02:00:00+00:00
modified: 2021-02-18T12:00:00+00:00
broader: http://cv.iptc.org/newscodes/mediatopic/16000000
narrower: http://cv.iptc.org/newscodes/mediatopic/20000057
narrower: http://cv.iptc.org/newscodes/mediatopic/20000058
narrower: http://cv.iptc.org/newscodes/mediatopic/20000060
narrower: http://cv.iptc.org/newscodes/mediatopic/20000062