Internationell militär intervention
type: Concept
preferred label: Intervention militaire internationale @fr
preferred label: Intervención militar internacional @es
preferred label: تدخل عسكري دولي @ar
preferred label: international military intervention @en-gb
preferred label: Internationale militärische Intervention @de
preferred label: intervenção militar internacional @pt-pt
preferred label: international militær indgriben @dk
preferred label: 国际军事介入 @zh-hans
preferred label: militær intervensjon @no-nb
definition: Zeitlich begrenzter Einsatz von internationalen Streitkräften in einem Land oder einer Region, welche(s) Hilfe von außen benötigt, zur Lösung einer Krise @de
definition: Présence temporaire de forces internationales dans un pays ou une région qui nécessite une aide extérieure pour résoudre une crise @fr
definition: Presencia temporal de fuerzas internacionales en un país o región que requiere asistencia externa para resolver una crisis @es
definition: Tillfälligt användande av internationella trupper i ett land eller en region, som behöver hjälp från utsidan för att lösa en kris.
definition: The temporary use of international forces in a country or region that requires outside help with resolving a crisis @en-gb
definition: Uso temporário de forças internacionais, seja por convite ou por decisão de órgão estrangeiro, num país ou numa região com intenção de resolver uma crise. @pt-pt
definition: Midlertidig brug af internationale tropper i et land eller en region, som har brug for hjælp udefra til at løse en krise. @dk
definition: 在需要外界帮助解决危机的国家或地区临时使用国际部队 @zh-hans
in scheme: mediatopic
created: 2009-10-22T02:00:00+00:00
modified: 2021-02-18T12:00:00+00:00
broader: http://cv.iptc.org/newscodes/mediatopic/20000056