Guerre civile
type: Concept
preferred label: Guerra civil @es
preferred label: Bürgerkrieg @de
preferred label: civil war @en-gb
preferred label: Inbördeskrig @se
preferred label: حرب اهلية @ar
preferred label: guerra civil @pt-pt
preferred label: borgerkrig @dk
preferred label: 国内战争 @zh-hans
preferred label: borgarkrig @no-nn
definition: Krig mellan olika grupper inom en och samma nation, ibland med målet att dela landet. @se
definition: Conflicto armado entre miembros de un mismo país, en algunos casos para dividir el país @es
definition: Conflit armé entre membres d'un même pays, dans certains cas dans le but de diviser le pays
definition: Armed conflict between members of the same country, in some cases with the goal of dividing the country @en-gb
definition: Bewaffnete Auseinandersetzung zwischen den Bewohnern eines Landes oder einer seiner Regionen, in einigen Fällen mit dem Ziel deren Aufteilung @de
definition: Conflito armado entre membros de um país ou de uma região geográfica, em alguns casos com intenção de causar a divisão do país ou da região. @pt-pt
definition: Krig mellem forskellige grupper inden for samme nation, undertiden med målet om at dele landet. @dk
definition: 同一国家各派别之间的武装冲突，在某些情况下是为了分裂国家 @zh-hans
in scheme: mediatopic
created: 2009-10-22T02:00:00+00:00
modified: 2021-02-18T12:00:00+00:00
broader: http://cv.iptc.org/newscodes/mediatopic/20000062