Troubles civils
type: Concept
definition: Rassemblements, grèves, manifestations, émeutes ou autres perturbations menées par une population, souvent pour protester contre les politiques ou les actions d'un gouvernement ou d'une autre organisation
in scheme: mediatopic
created: 2009-10-22T02:00:00+00:00
modified: 2021-02-18T12:00:00+00:00
broader: http://cv.iptc.org/newscodes/mediatopic/16000000