agitação civil
type: Concept
preferred label: اضطرابات اهلية @ar
preferred label: civil unrest @en-gb
preferred label: Troubles civils @fr
preferred label: Unruhen @de
preferred label: Disturbios @es
preferred label: Oroligheter @se
preferred label: civil urolighed @dk
preferred label: 内乱 @zh-hans
preferred label: demonstrasjoner og opptøyer @no-nb
preferred label: demonstrasjonar og opptøyar @no-nn
definition: Missnöje bland befolkningen som yttrar sig som strejker, massmöten, demonstrationer eller sabotage. @se
definition: Reuniones, huelgas, manifestaciones, disturbios u otras perturbaciones organizadas por una población para protestar por las políticas o acciones de un gobierno u otra organización @es
definition: Kundgebungen, Streiks, Demonstrationen, Ausschreitungen oder ein anderer Aufruhr in der Bevölkerung, meist aus Protest gegen die Regierung oder gegen die Politik oder gegen Aktionen einer anderen Organisation @de
definition: Rallies, strikes, demonstrations, riots or other disturbances by a population, often in protest to a government or other organization's policies or actions @en-gb
definition: Rassemblements, grèves, manifestations, émeutes ou autres perturbations menées par une population, souvent pour protester contre les politiques ou les actions d'un gouvernement ou d'une autre organisation @fr
definition: Insatisfação entre a população manifestada por comícios, greves, manifestações ou sabotagens.
definition: Insatisfação entre a população geral, conforme comprovado por comícios, greves, manifestações ou sabotagens.
definition: Uro blandt befolkningen, der kommer til udtryk ved strejker, oprør, demonstrationer eller sabotage. @dk
definition: 群众集会、罢工、示威、骚乱或其他动乱，通常是为了抗议政府或其他组织的政策或行动 @zh-hans
in scheme: mediatopic
created: 2009-10-22T02:00:00+00:00
modified: 2021-02-18T12:00:00+00:00
broader: http://cv.iptc.org/newscodes/mediatopic/16000000
narrower: http://cv.iptc.org/newscodes/mediatopic/20000066
narrower: http://cv.iptc.org/newscodes/mediatopic/20000067
narrower: http://cv.iptc.org/newscodes/mediatopic/20000068
narrower: http://cv.iptc.org/newscodes/mediatopic/20000069