Rébellion
type: Concept
definition: Actions d'opposition à un gouvernement ou à un parti au pouvoir, souvent violentes, organisées par les résidents d'une nation dans le but de renverser le gouvernement
in scheme: mediatopic
created: 2009-10-22T02:00:00+00:00
modified: 2021-02-18T12:00:00+00:00
broader: http://cv.iptc.org/newscodes/mediatopic/20000065