rebellion
type: Concept
preferred label: Rébellion @fr
preferred label: Rebellion @de
preferred label: Uppror @se
preferred label: تمرد @ar
preferred label: Rebelión @es
preferred label: rebeliões @pt-pt
preferred label: oprør @dk
preferred label: 叛乱 @zh-hans
preferred label: opprør @no-nb
definition: Acciones de oposición a un gobierno o partido gobernante, frecuentamente violentas, organizadas por los residentes de una nación con el objetivo de derrocar al gobierno @es
definition: Actions d'opposition à un gouvernement ou à un parti au pouvoir, souvent violentes, organisées par les résidents d'une nation dans le but de renverser le gouvernement @fr
definition: Organisierte Aktionen zum Widerspruch gegen eine Regierung oder regierende Partei durch die Bewohner eines Landes, oft gewalttätig und mit dem Ziel eines Regierungsumsturzes @de
definition: Organized actions of opposition to a government or ruling party by a country's residents, often violent and with the aim of overthrowing the government
definition: Organiserat angrepp mot statsmakten av någon grupp i samma land med syfte att störta regeringen och ändra det politiska systemet. @se
definition: Ações organizadas de oposição a um governo ou partido governante pelos cidadãos de um país, muitas vezes com violência e com a intenção de derrubar o governo. @pt-pt
definition: Organiseret angreb på statsmagten af en gruppe i det samme land, ofte voldeligt og med det formål at vælte regeringen og ændre det politiske system. @dk
definition: 由一个国家的居民组织起来的反对政府或执政党的行动，通常是暴力的，目的是推翻政府 @zh-hans
in scheme: mediatopic
created: 2009-10-22T02:00:00+00:00
modified: 2021-02-18T12:00:00+00:00
broader: http://cv.iptc.org/newscodes/mediatopic/20000065