Revoluciones
type: Concept
definition: Un cambio por la fuerza y a menudo violento, o un derrocamiento del sistema de gobierno o del orden social de un país, por parte de fuerzas internas, en favor de un nuevo sistema
in scheme: mediatopic
created: 2009-10-22T02:00:00+00:00
modified: 2021-02-18T12:00:00+00:00
broader: http://cv.iptc.org/newscodes/mediatopic/20000065