revolution
type: Concept
preferred label: ثورة @ar
preferred label: Revolution @de
preferred label: Révolution @fr
preferred label: Revoluciones @es
preferred label: revoluções @pt-pt
preferred label: 革命 @zh-hans
preferred label: revolusjon @no-nb
definition: A forcible and often violent change to, or overthrow of, a country's political system or social order by internal forces, in favour of a new system
definition: Changement par la force et souvent violent, ou renversement, du système de gouvernement ou de l'ordre social d'un pays par des forces internes, en faveur d'un nouveau système @fr
definition: Större, väpnad, organiserad omstörtning av det bestående samhället. @se
definition: Ein oft gewalttätiger Wechsel oder Umsturz der Regierung eines Landes oder von dessen politischen System durch Kräfte aus dem Land um ein neues System durchzusetzen. @de
definition: Un cambio por la fuerza y a menudo violento, o un derrocamiento del sistema de gobierno o del orden social de un país, por parte de fuerzas internas, en favor de un nuevo sistema @es
definition: Alteração por vezes violenta do sistema governativo de um país, feita por forças internas que provocam mudanças sociais sistemáticas. @pt-pt
definition: Større, væbnet og organiseret omstyrtning af det eksisterende samfund. @dk
definition: 内部势力为支持一种新制度而强行改变或推翻一个国家的政治制度或社会秩序，这种改变通常是暴力的 @zh-hans
definition: A forcible and often violent change to, or overthrow of, a country's political system or social order by internal forces, in favor of a new system
in scheme: mediatopic
created: 2009-10-22T02:00:00+00:00
modified: 2021-02-18T12:00:00+00:00
broader: http://cv.iptc.org/newscodes/mediatopic/20000065