Ausschreitung
type: Concept
definition: Gewalttätige, zerstörerische Aktionen des zivilen Ungehorsams durch Personengruppen, oft in Reaktion auf einen Missstand oder als aktiver Widerstand, meist mit Verletzungen von Personen verbunden
in scheme: mediatopic
created: 2009-10-22T02:00:00+00:00
modified: 2021-02-18T12:00:00+00:00
broader: http://cv.iptc.org/newscodes/mediatopic/20000065