Disturbios
type: Concept
definition: Eventos violentos y destructivos de desorden civil por grupos de personas, por lo general en respuesta a un agravio o como actos de oposición, causando frecuentamente heridas a personas y destrucción de propiedad
in scheme: mediatopic
created: 2009-10-22T02:00:00+00:00
modified: 2021-02-18T12:00:00+00:00
broader: http://cv.iptc.org/newscodes/mediatopic/20000065