Emeutes
type: Concept
definition: Troubles de l'ordre public provoqués par des groupes de personnes, en réponse à un grief ou pour faire acte d'opposition, provoquant souvent des violences, des blessures et des destructions de biens
in scheme: mediatopic
created: 2009-10-22T02:00:00+00:00
modified: 2021-02-18T12:00:00+00:00
broader: http://cv.iptc.org/newscodes/mediatopic/20000065