coup d'etat
type: Concept
preferred label: انقلاب @ar
preferred label: Golpe de estado @es
preferred label: Staatsstreich @de
preferred label: Coup d'Etat @fr
preferred label: Statskupp @se
preferred label: golpe de estado @pt-pt
preferred label: statskup @dk
preferred label: 政变 @zh-hans
preferred label: statskupp @no-nb
definition: The overthrow of an established government by an organised military or political group
definition: Derrocamiento de un gobierno por un grupo militar o político organizado @es
definition: Plötsligt och (vanligen) med våld genomfört maktskifte i en stat, vanligtvis av (del av) krigsmakten och utan folkets deltagande. @se
definition: Renversement d'un gouvernement par un groupe militaire ou politique organisé @fr
definition: Der Sturz einer bestehenden Regierung durch eine organisierte militärische oder politische Gruppe @de
definition: Derrube de um governo, feito por um grupo organizado, geralmente militar ou político. @pt-pt
definition: Derrube de um governo estabelecido, feito por um grupo organizado, geralmente militar ou político. @pt-br
definition: Omstyrtning af en etableret regering af en organiseret militær eller politisk gruppe. @dk
definition: 有组织的军事或政治团体推翻现有政权 @zh-hans
definition: The overthrow of an established government by an organized military or political group
in scheme: mediatopic
created: 2009-10-22T02:00:00+00:00
modified: 2021-02-18T12:00:00+00:00
broader: http://cv.iptc.org/newscodes/mediatopic/16000000