Massaker
type: Concept
preferred label: مجزرة @ar
preferred label: Massacre @fr
preferred label: massacre @en-gb
preferred label: Matanza @es
preferred label: massakre @dk
preferred label: 大屠杀 @zh-hans
definition: Samtidigt dödande av många människor, ofta civila, under krigstid.
definition: Masacre de personas, generalmente civiles, durante las hostilidades de una guerra @es
definition: Der Massenmord an einer Gruppe von Menschen, meist Zivilisten, während einer kriegerischen Auseinandersetzung. @de
definition: The mass killing of people, usually civilians, during wartime hostilities @en-gb
definition: Massacre de personnes, généralement des civils, pendant les hostilités en temps de guerre @fr
definition: Morte de um grande grupo de pessoas num curto período de tempo. @pt-pt
definition: Morte de um grande grupo de pessoas em um curto período de tempo. @pt-br
definition: Massedrab på mennesker, ofte civile, under krig eller konflikt @dk
definition: 战争期间对人民，通常是平民的大规模杀戮 @zh-hans
in scheme: mediatopic
created: 2009-10-22T02:00:00+00:00
modified: 2021-02-18T12:00:00+00:00
broader: http://cv.iptc.org/newscodes/mediatopic/16000000