Reconstruction
type: Concept
definition: Actions pour reconstruire une société, une économie ou un système politique dans une zone touchée par la guerre
in scheme: mediatopic
created: 2009-10-22T02:00:00+00:00
modified: 2021-02-18T12:00:00+00:00
broad match: http://cv.iptc.org/newscodes/subjectcode/11002000
broader: http://cv.iptc.org/newscodes/mediatopic/16000000