post-war reconstruction
type: Concept
preferred label: Återuppbyggnad @se
preferred label: Wiederaufbau @de
preferred label: Reconstruction @fr
preferred label: اعمار ما بعد الحرب @ar
preferred label: Reconstrucción @es
preferred label: reconstrução pós-guerra @pt-pt
preferred label: genopbygning efter krig @dk
preferred label: 战后重建 @zh-hans
preferred label: gjenreisning @no-nb
preferred label: atterreising @no-nn
definition: Acciones para reconstruir una sociedad, economía o sistema político en una zona afectada por la guerra @es
definition: Actions pour reconstruire une société, une économie ou un système politique dans une zone touchée par la guerre @fr
definition: Åtgärder för att återskapa samhället, ekonomin och det politiska systemet i ett krigshärjat område. @se
definition: Aktivitäten zur Wiederherstellung der Gesellschaft, Wirtschaft oder des politischen Systems in einem Gebiet nach einem Krieg @de
definition: Actions to rebuild a society, economy or political system in an area affected by war
definition: Ações para reconstruir uma sociedade, economia ou sistema político numa área afetada pela guerra. @pt-pt
definition: Foranstaltninger til at genoprette samfundet, økonomien og det politiske system i et krigshærget område. @dk
definition: 重建受战争影响地区的社会、经济或政治制度的行动 @zh-hans
in scheme: mediatopic
created: 2009-10-22T02:00:00+00:00
modified: 2021-02-18T12:00:00+00:00
broad match: http://cv.iptc.org/newscodes/subjectcode/11002000
broader: http://cv.iptc.org/newscodes/mediatopic/16000000
narrower: http://cv.iptc.org/newscodes/mediatopic/20000079