fogo posto
type: Concept
preferred label: Anlagd brand @se
preferred label: Incendio premeditado @es
preferred label: Brandstiftung @de
preferred label: Incendie volontaire @fr
preferred label: arson @en-gb
preferred label: حريق متعمد @ar
preferred label: incêndio criminoso
preferred label: forsætlig brandstiftelse @dk
preferred label: 纵火 @zh-hans
preferred label: brannstiftelse @no-nb
preferred label: eldspåsetjing @no-nn
definition: Att medvetet tända eld på något som man inte har rätt att elda upp. @se
definition: Absichtliches in Brand stecken mit krimineller Intention @de
definition: The intentional setting of fires with criminal intent @en-gb
definition: Incêndio intencional, de origem criminosa.
definition: Med forsættelighed at brænde noget af, som man ikke har ret til. @dk
definition: 故意放火或恶意烧毁建筑、财产等 @zh-hans
in scheme: mediatopic
created: 2009-10-22T02:00:00+00:00
modified: 2021-02-18T12:00:00+00:00
broader: http://cv.iptc.org/newscodes/mediatopic/20000082