Sexuelle Gewalt
type: Concept
preferred label: اعتداء جنسي @ar
preferred label: Agression sexuelle @fr
preferred label: sex crime @en-gb
preferred label: Agresión sexual @es
preferred label: Våldtäkt @se
preferred label: crimes sexuais @pt-pt
preferred label: seksualforbrydelse @dk
preferred label: 性犯罪 @zh-hans
preferred label: seksualforbrytelser @no-nb
preferred label: seksualbrotsverk @no-nn
definition: Sexuellt relaterat våld. @se
definition: Sexual crimes against a person, such as rape, harassment, molestation or groping @en-gb
definition: Sexuelle Nötigung und Körperverletzung
definition: Agressão de natureza sexual cometida contra outra pessoa, como violação, assédio ou molestamento. @pt-pt
definition: Seksuel relateret vold, herunder voldtægt, overgreb, chikane eller befamling. @dk
definition: 对人的性犯罪，如强奸、骚扰、性骚扰或猥亵 @zh-hans
in scheme: mediatopic
created: 2009-10-22T02:00:00+00:00
modified: 2021-02-18T12:00:00+00:00
broader: http://cv.iptc.org/newscodes/mediatopic/20000084