Computerkriminalität
type: Concept
preferred label: Piratage informatique @fr
preferred label: cyber crime @en-gb
preferred label: جريمة معلوماتية @ar
preferred label: IT-brott @se
preferred label: Delitos informáticos @es
preferred label: cibercrime @pt-pt
preferred label: cyberkriminalitet @dk
preferred label: 网络犯罪 @zh-hans
preferred label: nettkriminalitet @no-nb
definition: Diebstahl oder zerstörerisches Verhalten mithilfe eines Computers
definition: Brottslig aktivitet som främst utförs genom att använda datorer och/eller internet, t ex hacking, phising och identitetsstölder. @se
definition: Criminal activities carried out by means of computers or the internet, such as hacking, phishing scams and identity theft @en-gb
definition: Atividades criminosas cometidas através de computadores ou através da Internet, como hacking, roubo de entidade ou phishing. @pt-pt
definition: Kriminel aktivitet, der primært udføres ved hjælp af computere og/eller internettet, for eksempel hacking, phishing og identitetstyveri. @dk
definition: 利用计算机或互联网进行的犯罪活动，如黑客、网络钓鱼欺诈和身份盗窃 @zh-hans
in scheme: mediatopic
created: 2009-10-22T02:00:00+00:00
modified: 2023-03-31T12:00:00+00:00
broader: http://cv.iptc.org/newscodes/mediatopic/20000082