peculato
type: Concept
preferred label: اختلاس اموال @ar
preferred label: Malversación @es
preferred label: Förskingring @se
preferred label: Détournement de fonds @fr
preferred label: embezzlement @en-gb
preferred label: Unterschlagung @de
preferred label: underslæb @dk
preferred label: 挪用公款 @zh-hans
preferred label: underslag @no-nb
definition: Absichtlicher Diebstahl von anvertrautem Geld @de
definition: Medveten stöld eller felaktig användning av pengar som man satts att sköta för någon uppdragsgivare. @se
definition: The intentional theft or misuse of money left in one's care or belonging to one's employer @en-gb
definition: Desvio e roubo de dinheiros públicos por quem os tinha a seu cargo.
definition: Roubo intencional de dinheiro deixado a cargo de alguém.
definition: Bevidst tyveri eller forkert anvendelse af penge, som forvaltes for enhver klient, eller som tilhører en arbejdsgiver. @dk
definition: 故意盗窃或滥用他人保管或属于雇主的钱财 @zh-hans
in scheme: mediatopic
created: 2009-10-22T02:00:00+00:00
modified: 2021-02-18T12:00:00+00:00
broader: http://cv.iptc.org/newscodes/mediatopic/20000087