Drogenkriminalität
type: Concept
preferred label: جرائم مخدرات @ar
preferred label: drug related crimes @en-gb
preferred label: Crímenes relacionados con las drogas @es
preferred label: Narkotikabrott @se
preferred label: Crimes liés aux stupéfiants @fr
preferred label: crimes relacionados com drogas @pt-pt
preferred label: narkokriminalitet @dk
preferred label: 毒品犯罪 @zh-hans
preferred label: narkotikalovbrudd @no-nb
preferred label: narkotikalovbrot @no-nn
definition: Alle Arten von Kriminalität im Zusammenhang mit Drogen
definition: Illegal activities involving illicit substances, including buying, distribution, selling and smuggling @en-gb
definition: Aktiviteter som bryter mot lagar kring hantering av narkotiska preparat och utrustning. @se
definition: Atividades ilegais que envolvem substâncias ilícitas, incluindo a compra, a distribuição, a venda e o tráfego. @pt-pt
definition: Aktiviteter, der overtræder love om håndtering af narkotiske stoffer og udstyr. @dk
definition: 涉及违禁药品的非法活动，包括购买、分销、售卖和走私 @zh-hans
in scheme: mediatopic
created: 2009-10-22T02:00:00+00:00
modified: 2021-02-18T12:00:00+00:00
broader: http://cv.iptc.org/newscodes/mediatopic/20000082
narrower: http://cv.iptc.org/newscodes/mediatopic/20000096
broad match: http://cv.iptc.org/newscodes/subjectcode/02001000