tráfico de droga
type: Concept
preferred label: تهريب مخدرات @ar
preferred label: Trafic de drogue @fr
preferred label: drug trafficking @en-gb
preferred label: Narkotikasmuggling @se
preferred label: Narcotráfico @es
preferred label: Drogenhandel @de
preferred label: narkosmugling @dk
preferred label: 贩毒 @zh-hans
preferred label: narkotikahandel @no-nb
definition: Att illegalt föra droger mellan olika länder. @se
definition: Dealing in illicit often harmful substances @en-gb
definition: Unerlaubter Handel mit meist gesundheitsgefährdenden Stoffen @de
definition: Tráfico de substâncias ilícitas.
definition: Tráfico de substâncias ilegais.
definition: Ulovlig smugle narkotika mellem forskellige lande. @dk
definition: 从事有害药品的非法交易 @zh-hans
in scheme: mediatopic
created: 2009-10-22T02:00:00+00:00
modified: 2021-02-18T12:00:00+00:00
broader: http://cv.iptc.org/newscodes/mediatopic/20000095