Bedrägeri
type: Concept
preferred label: احتيال @ar
preferred label: Fraude @fr
preferred label: Betrug @de
preferred label: fraud @en-gb
preferred label: fraude @pt-pt
preferred label: bedrageri @dk
preferred label: 欺诈 @zh-hans
definition: Intentional deception for personal or financial gain @en-gb
definition: Planerade aktiviteter för att lura till sig pengar eller värdesaker från andra personer, företag eller organisationer.
definition: Absichtliche Täuschung, die die Rechte und das Eigentum anderer beschädigen @de
definition: Engano intencional para ganho pessoa ou financeiro. @pt-pt
definition: Planlagte aktiviteter for at bedrage penge eller værdigenstande fra andre mennesker, virksomheder eller organisationer. @dk
definition: 为个人或经济利益而故意欺骗 @zh-hans
in scheme: mediatopic
created: 2009-10-22T02:00:00+00:00
modified: 2021-02-18T12:00:00+00:00
broader: http://cv.iptc.org/newscodes/mediatopic/20000082
narrower: http://cv.iptc.org/newscodes/mediatopic/20001195