Entführung
type: Concept
preferred label: قرصنة @ar
preferred label: Secuestro / piratería @es
preferred label: Kapning @se
preferred label: Détournement @fr
preferred label: hijacking @en-gb
preferred label: kapring @dk
preferred label: 劫持 @zh-hans
definition: Taking over a transportation vehicle by force @en-gb
definition: Übernahme eines Transportfahrzeuges mit Gewalt
definition: Att med våld ta över någon form av transportfordon. @se
definition: Captura forçada de um veículo de transporte. @pt-pt
definition: Overtagelse af transportmiddel ved tvang. @dk
definition: 强行接管交通工具 @zh-hans
in scheme: mediatopic
created: 2009-10-22T02:00:00+00:00
modified: 2021-02-18T12:00:00+00:00
broad match: http://cv.iptc.org/newscodes/subjectcode/02001000
broader: http://cv.iptc.org/newscodes/mediatopic/20000082