帮派活动
type: Concept
definition: 群体性犯罪活动，这个群体由具有相同地域、语言或种族背景的人组成，并具有相同的可辨识的称呼、纹身、服饰风格等特点
in scheme: mediatopic
created: 2009-10-22T02:00:00+00:00
modified: 2021-05-05T12:00:00+00:00
broader: http://cv.iptc.org/newscodes/mediatopic/20000101