Stöld
type: Concept
preferred label: سرقة @ar
preferred label: Robo @es
preferred label: robbery and theft @en-gb
preferred label: Diebstahl @de
preferred label: Vol @fr
preferred label: roubo @pt-pt
preferred label: tyveri @dk
preferred label: 盗窃 @zh-hans
preferred label: tyveri og innbrudd @no-nb
preferred label: tjuveri og innbrot @no-nn
definition: Att olagligt ta någon annans egendom.
definition: Ungesetzliche Beschaffung @de
definition: The taking of another person's property without their consent, sometimes by force @en-gb
definition: Apropriação ilegal. @pt-pt
definition: Ulovlig erhvervelse af en andens ejendom. @dk
definition: 非法占有他人财物的行为 @zh-hans
in scheme: mediatopic
created: 2009-10-22T02:00:00+00:00
modified: 2021-05-05T12:00:00+00:00
broader: http://cv.iptc.org/newscodes/mediatopic/20000082