processos preliminares
type: Concept
preferred label: Anhörung @de
preferred label: Audiencias preliminares @es
preferred label: Domstolsförberedelser @se
preferred label: جلسة تمهيدية @ar
preferred label: Audiences préliminaires @fr
preferred label: pre-trial @en-gb
preferred label: Forberedende retsmøde @dk
preferred label: 初审 @zh-hans
preferred label: varetekt @no-nb
definition: Saker som sker som förberedelse innan rättsfallet tas upp i en domstol. @se
definition: Vorgerichtliches Vorgehen inklusive Verteidigung, Kaution, Anträge, Indizien, Aussagen @de
definition: Actions that happen before the start of a trial, such as pleas, bail motions, discovery and depositions @en-gb
definition: Procedimentos anteriores à fase de julgamento que incluem arguições, fianças, moções e depoimentos.
definition: Eventos preliminares que incluem arguições, fianças, moções, descobertas, depoimentos.
definition: Forberedende retsbehandling, før de egentlige retsmøder @dk
definition: 审判前事件包括抗辩、保释、声请、证据揭示、取口供证词 @zh-hans
in scheme: mediatopic
created: 2009-10-22T02:00:00+00:00
modified: 2021-05-05T12:00:00+00:00
broader: http://cv.iptc.org/newscodes/mediatopic/20000111