pena / sentença
type: Concept
preferred label: sentencing (criminal) @en-gb
preferred label: Strafe @de
preferred label: Straff @se
preferred label: عقوبة @ar
preferred label: Penas @es
preferred label: Peines @fr
preferred label: pena/sentença
preferred label: straf (kriminel) @dk
preferred label: 刑罚 @zh-hans
preferred label: straffeutmåling @no-nb
definition: Vergeltung, die gegen Gesetzesbrecher verhängt wird @de
definition: Påföljd mot personer (eller organisationer) som fällts för brott. @se
definition: The retribution handed out to those who break laws @en-gb
definition: Sentenças impostas àqueles que infringem as leis.
definition: Straf af personer eller organisationer, der er dømt for kriminalitet. @dk
definition: 对违法者的惩罚 @zh-hans
in scheme: mediatopic
created: 2009-10-22T02:00:00+00:00
modified: 2021-02-18T12:00:00+00:00
broader: http://cv.iptc.org/newscodes/mediatopic/20000111
narrower: http://cv.iptc.org/newscodes/mediatopic/20000135
narrower: http://cv.iptc.org/newscodes/mediatopic/20000136
narrower: http://cv.iptc.org/newscodes/mediatopic/20000137
narrower: http://cv.iptc.org/newscodes/mediatopic/20001198
narrower: http://cv.iptc.org/newscodes/mediatopic/20001199