explosion accident and incident
type: Concept
preferred label: Explosión @es
preferred label: حادث انفجار @ar
preferred label: Explosioner @se
preferred label: Explosion @de
preferred label: Explosion accidentelle @fr
preferred label: explosão @pt-pt
preferred label: eksplosionsulykke og -hændelse @dk
preferred label: 爆炸事故 @zh-hans
preferred label: eksplosjoner @no-nb
preferred label: eksplosjonar @no-nn
definition: När någon form av sprängmedel detoneras. @se
definition: Jede ungeplante und plötzliche Ausbreitung einer Menge von Materie @de
definition: Explosions caused by an accidental, non-combat, or non-terrorism source. Also use when the source of the explosion is non-specified or unknown
definition: Súbita fragmentação de um corpo, devido à dilatação de gases ou à conflagração de matérias. @pt-pt
definition: En pludselig detonering af sprængstof @dk
definition: 由意外、非战斗或非恐怖主义原因导致的爆炸。当爆炸源不明时也可使用 @zh-hans
change note: Change Note 2015-08-27: English name changed
in scheme: mediatopic
created: 2009-10-22T02:00:00+00:00
modified: 2021-05-05T12:00:00+00:00
broader: http://cv.iptc.org/newscodes/mediatopic/20000139