Affärsavtal
type: Concept
preferred label: Contrato comercial @es
preferred label: عقد تجاري @ar
preferred label: Vertrag @de
preferred label: commercial contract @en-gb
preferred label: Contrat commercial @fr
preferred label: contrato comercial @pt-pt
preferred label: forretningsaftale @dk
preferred label: 商业合同 @zh-hans
preferred label: forretningsavtale @no-nb
definition: Verträge bezüglich Verkaufsaktivitäten @de
definition: Kontrakt avseende kommersiella aktiviteter.
definition: Contracts regarding commercial activities @en-gb
definition: Contratos relativos a atividades comerciais. @pt-pt
definition: Aftale om køb eller salg, af varer, rettigheder eller fast ejendom. @dk
definition: 关于商业活动的合同 @zh-hans
in scheme: mediatopic
created: 2009-10-22T02:00:00+00:00
modified: 2021-02-18T12:00:00+00:00
broader: http://cv.iptc.org/newscodes/mediatopic/20000192