company spin-off
type: Concept
preferred label: Företagsavknoppning @se
preferred label: Scission @fr
preferred label: Firmenausgründung @de
preferred label: Escisión de sociedades @es
preferred label: تحويل اصول @ar
preferred label: spin-off @pt-pt
preferred label: spin-off virksomhed @dk
preferred label: 公司分拆 @zh-hans
preferred label: spin-off-selskap @no-nb
definition: The creation of new companies being spun off from existing companies
definition: Skapandet av nya företag genom avknoppningar från befintliga företag. @se
definition: Gründung neuer Firmen, die sich aus bestehenden Firmen ausgegliedert haben @de
definition: Criação de empresas novas a partir de divisões de empresas existentes. @pt-pt
definition: Oprettelse af nye virksomheder gennem spinoffs fra eksisterende virksomheder. @dk
definition: 从现有公司分离出来的新公司 @zh-hans
definition: The creation of new companies being spun off from existing companies.
definition: Når delar av eit selskap blir skilt ut i ei separat verksemd. @no-nn
definition: Når deler av et selskap skilles ut i en separat virksomhet. @no-nb
in scheme: mediatopic
created: 2009-10-22T02:00:00+00:00
modified: 2023-03-31T12:00:00+00:00
broader: http://cv.iptc.org/newscodes/mediatopic/20001366