patente, direitos de autor e marca registada
type: Concept
preferred label: Patentes, propiedad intelectual, marcas registradas @es
preferred label: patent, copyright and trademark @en-gb
preferred label: Patent, Copyright und Warenzeichen @de
preferred label: Brevet, droit d'auteur et marque déposée @fr
preferred label: Patent, upphovsrätt och varumärke @se
preferred label: براءة، حقوق نشر وعلامة تجارية @ar
preferred label: patente, direitos de autor e marca registrada
preferred label: patent, ophavsret og varemærke @dk
preferred label: 专利、版权和商标 @zh-hans
preferred label: patent, opphavsrett og merkevare @no-nb
preferred label: patent, rettar og merkevarer @no-nn
definition: Patente, Copyright und Warenzeichen @de
definition: Ensamrätt att exploatera en uppfinning, laglig rätt för upphovsman att ensam bestämma över användningen av sitt verk och lagligen skyddat namn eller kännetecken på varor och tjänster från en viss näringsidkare. @se
definition: Intellectual properties such as patents, copyright and trademarks @en-gb
definition: Propriedades intelectuais enquanto patentes, direitos de autor e marcas registadas.
definition: Propriedades intelectuais enquanto patentes, direitos de autor e marcas registradas.
definition: Eksklusiv ret til at udnytte en opfindelse, juridisk ret for forfatteren til kun at beslutte brugen af sit arbejde og lovligt beskyttede navn eller karakteristika for varer og tjenester for en bestemt erhvervsdrivende. @dk
definition: 专利、版权和商标等知识产权 @zh-hans
in scheme: mediatopic
created: 2009-10-22T02:00:00+00:00
modified: 2023-03-31T12:00:00+00:00
broader: http://cv.iptc.org/newscodes/mediatopic/20000192