Fiskerinäring
type: Concept
preferred label: Fischindustrie @de
preferred label: Industria pesquera @es
preferred label: صناعة سمكية @ar
preferred label: Pêche @fr
preferred label: commercial fishing @en-gb
preferred label: pesca @pt-pt
preferred label: fiskeindustri @dk
preferred label: 渔业 @zh-hans
preferred label: fiskeri og havbruk @no-nb
definition: Fish farming and commercial activity around the catching of fish and seafood for consumption @en-gb
definition: Uppfödning eller insamlande av fisk.
definition: Züchten und Fangen von Fisch @de
definition: Criação ou recolha de peixe. @pt-pt
definition: Opdræt eller fangst af fisk. @dk
definition: 鱼类养殖和捕捞 @zh-hans
in scheme: mediatopic
created: 2009-10-22T02:00:00+00:00
modified: 2023-03-31T12:00:00+00:00
broader: http://cv.iptc.org/newscodes/mediatopic/20000209