Kemisk industri
type: Concept
preferred label: مواد كيميائية @ar
preferred label: Productos químicos @es
preferred label: Chemie @de
preferred label: chemicals @en-gb
preferred label: Chimie @fr
preferred label: produtos químicos @pt-pt
preferred label: kemikalie @dk
preferred label: 化工产品 @zh-hans
preferred label: kjemikalier @no-nb
preferred label: kjemikaliar @no-nn
definition: Natürliche oder künstliche Stoffe, um andere Materialien zu erzeugen @de
definition: Natural or manmade materials used to produce other materials @en-gb
definition: Naturliga eller skapade ämnen som används för att producera annat material.
definition: Materiais naturais ou feitos pelo homem para produzir outros materiais. @pt-pt
definition: Naturlige eller kunstige stoffer, der bruges til at fremstille andre materialer. @dk
definition: 用于生产其他材料的天然或人造材料 @zh-hans
in scheme: mediatopic
created: 2009-10-22T02:00:00+00:00
modified: 2021-02-18T12:00:00+00:00
broader: http://cv.iptc.org/newscodes/mediatopic/20000209
narrower: http://cv.iptc.org/newscodes/mediatopic/20000219
narrower: http://cv.iptc.org/newscodes/mediatopic/20000220
narrower: http://cv.iptc.org/newscodes/mediatopic/20000221
narrower: http://cv.iptc.org/newscodes/mediatopic/20000222
narrower: http://cv.iptc.org/newscodes/mediatopic/20001395