tecnologia sem fios
type: Concept
preferred label: Technologies mobiles @fr
preferred label: Wireless-Technologie @de
preferred label: Trådlös teknik @se
preferred label: Tecnología inalámbrica @es
preferred label: تكنولوجيا اتصالات لاسلكية @ar
preferred label: wireless technology @en-gb
preferred label: tecnologia sem fio
preferred label: trådløs teknologi @dk
preferred label: 无线技术 @zh-hans
preferred label: trådløs kommunikasjon @no-nb
preferred label: trådlaus kommunikasjon @no-nn
definition: Technology and services that permit the transfer of information between separated points without physical connection, including Bluetooth and Wi-Fi networks @en-gb
definition: Austausch von Informationen mit Mitteln außerhalb der direkten verdrahteten Schaltung @de
definition: Överföring av information på andra sätt än genom kablar. @se
definition: Transmissão de informação sem utilizar fios ou cabos conectados.
definition: Overførsel af information på andre måder end via kabler. @dk
definition: 除点对点有线连接以外的其他传输信息方式 @zh-hans
in scheme: mediatopic
created: 2009-10-22T02:00:00+00:00
modified: 2024-07-01T12:00:00+00:00
broader: http://cv.iptc.org/newscodes/mediatopic/20000225