house building
type: Concept
preferred label: Wohnungsbau @de
preferred label: بناء مساكن @ar
preferred label: Bâtiment @fr
preferred label: Construcción de viviendas @es
preferred label: Husbyggnad @se
preferred label: construção civil @pt-pt
preferred label: boligbyggeri @dk
preferred label: 住房建设 @zh-hans
preferred label: husbygging @no-nb
definition: Construction of residences, for private use
definition: Bau von Wohnraum zur privaten Nutzung @de
definition: Bygge av bostäder för privat bruk. @se
definition: Construção de residências, para uso privado. @pt-pt
definition: Opførelse af boliger til privat brug. @dk
definition: 建设住宅供私人使用 @zh-hans
definition: Bygging av bustader til privat bruk. @no-nn
definition: Bygging av boliger til privat bruk @no-nb
change note: Retired. Use medtop:20001368 residential real estate instead.
in scheme: mediatopic
created: 2009-10-22T02:00:00+00:00
modified: 2023-03-31T12:00:00+00:00
retired: 2023-03-31T12:00:00+00:00
broader: http://cv.iptc.org/newscodes/mediatopic/20000235