Bekleidung
type: Concept
preferred label: Vestuario @es
preferred label: Kläder @se
preferred label: Habillement @fr
preferred label: البسة @ar
preferred label: clothing @en-gb
preferred label: vestuário @pt-pt
preferred label: tøj @dk
preferred label: 服装 @zh-hans
preferred label: klær @no-nb
preferred label: klede @no-nn
definition: Plagg som människor bär på kroppen, till exempel tröjor, skjortor, kjolar, klänningar och byxor. @se
definition: The manufacturing and purchasing of apparel @en-gb
definition: Waren, die als Kleidung getragen werden
definition: Artigos de vestuário. @pt-pt
definition: Tøj, som folk bruger på kroppen, såsom sweatere, skjorter, nederdele, kjoler og bukser. @dk
definition: 用于穿着的物品 @zh-hans
in scheme: mediatopic
created: 2009-10-22T02:00:00+00:00
modified: 2023-03-31T12:00:00+00:00
broader: http://cv.iptc.org/newscodes/mediatopic/20000243