market trend
type: Concept
preferred label: Marknadstrender @se
preferred label: Tendencias de mercado @es
preferred label: Marktentwicklung @de
preferred label: Tendance du marché @fr
preferred label: اتجاهات السوق @ar
preferred label: indicadores de consumo @pt-pt
preferred label: markedsudvikling @dk
preferred label: 市场趋势 @zh-hans
preferred label: markedstrend @no-nb
preferred label: marknadstrend @no-nn
definition: Statistisch relevantes Konsumverhalten. @de
definition: Utvecklingsriktning styrd av konsumentbeteende. @se
definition: Statistically significant consumer behaviour.
definition: Comportamento estatisticamente significativo dos consumidores. @pt-pt
definition: Udviklingsretning styret af forbrugeradfærd. @dk
definition: 具有统计学意义的消费者行为 @zh-hans
definition: Statistically significant consumer behavior.
in scheme: mediatopic
created: 2009-10-22T02:00:00+00:00
modified: 2023-03-31T12:00:00+00:00
broader: http://cv.iptc.org/newscodes/mediatopic/20000192